{"text_format":"1","workbook":"xlsx","n_sheets":2,"sheets":["formulaire","outil"],"not_rendered":{"charts":0,"images":1,"macros":1,"external_links":0,"defined_names":4,"comments":0,"pivot_tables":0},"unopened":[],"bounds":{"document_bytes":16777216,"sheet_cells":100000,"rows_first":2000,"rows_last":500,"rows_between":2000,"halvings":0,"cell_chars":16384,"cell_head_chars":4096},"cells_cut":0,"cells_raw":0,"read":"whole","date_system":"1900"}

{"sheet":"formulaire","index":0,"n_rows":181,"n_cols":9,"rows_kept":181,"cut":false,"hidden":false,"merged":[[171,0,171,6],[136,0,136,6],[143,0,143,6],[145,0,145,6],[152,0,152,6],[167,0,167,6],[169,0,169,6],[32,4,32,6],[125,0,125,6],[63,0,63,6],[66,0,66,6],[83,0,83,6],[95,0,95,6],[107,0,107,6],[116,0,116,6],[123,0,123,6]]}
[]
[]
[]
[null,null,null,"YES Vélizy le Bois (YES VLB), association de loi 1901, a pour principal but de favoriser,"]
[null,null,null," développer et promouvoir la connaissance du groupe THALES et de ses valeurs."]
[]
[null,null,null,"Si vous souhaitez adhérer et participer aux activités de YES Vélizy le Bois, merci de bien vouloir"]
[null,null,null,"retourner ce formulaire complété, par mail à : ",null,"yes.vlb@thalesgroup.com"]
[]
[]
[]
[null,null,null,"Nous rappelons que l’adhésion à YES Vélizy le Bois n'est soumise à aucune cotisation[1]. "]
[]
[null,null,null,"* Données obligatoires"]
[null,null,null,"TGI*:",null,null,null,{"$f":"IF(E15=\"\",\"\",IF(OR(LEFT(E15,1)<>\"T\", LEN(E15)<>8),\" <--- TGI non valide : veuillez corriger\",\"\"))","v":""}]
[]
[null,null,null,"Nom*:",null,"Prénom*:"]
[]
[null,null,null,"Société*:",null,"Service*:"]
[]
[null,null,null,"Tél. Professionnel :",null,"Tél. Portable :"]
[]
[null,null,null,"Email professionnel*: ",null,null,null,{"$f":"IF(AND(E17<>\"\",G17<>\"\",E23=\"\"), \"<- précisez votre adresse mail (liste de choix)\",\"\")","v":""}]
[]
[null,null,null,"Site*:"]
[]
[null,null,null,"Type de contrat*: ",null,null,null,{"$f":"IF(E27=\"\",\"\",IF(ISERROR(MATCH($E$27,outil!$A$2:$A$5,0)),\"<- attention : type non reconnu. \",\"\")) & IF(AND(E17<>\"\",E27=\"\"),\"<-- Veuillez sélectionner dans la liste de choix\",\"\")","v":""}]
[]
[null,null,null,{"$f":"IF(OR(E27=outil!A4,E27=outil!A2),\"Indiquer la date de fin :\",\"\")","v":""},null,null,null,{"$f":"IF(E27=\"\",\"\",IF(AND(E27=\"CDI\",E29<>\"\"),\"pas de date de fin pour un CDI\",IF(AND(E27<>\"CDI\",E29=\"\"),\"<-- date à renseigner\",\"\")))","v":""},{"$f":"IF(E29=\"\",\"\",IF(OR(E29<TODAY(),E29>TODAY()+3000),\"date non valide (utiliser format jj/mm/aaaa)\",\"\"))","v":""}]
[]
[null,null,null,"Poste occupé : "]
[]
[null,null,null,"Commentaires"]
[]
[]
[null,null,null,"* J’ai pris connaissance du règlement intérieur de YES Vélizy le Bois et en accepte les conditions."]
[]
[null,null,null,"* J’autorise l’association YES Vélizy le Bois à diffuser les photographies et les vidéos me représentant dans"]
[null,null,null,"le cadre des activités organisées par l’association sur tout support (intranet, internet, etc.), pour tout usage tant "]
[null,null,null,"interne qu’externe à Thales, dans le monde entier et pour une durée de dix (10) ans."]
[]
[null,null,null," J’accepte de recevoir par email de la part de yes.vlb@thalesgroup.com, les informations sur l’actualité de l’association."]
[]
[]
[null,null,null,null,"Fait le "]
[null,null,null,null,"à"]
[]
[null,null,null,null,"Signature :",null,null,{"$f":"IF(AND(F48=\"\",E17<>\"\"),\"<-- Veuillez sélectionner dans la liste de choix\",\"\")","v":""}]
[null,null,null,"      .      .     .      .      .      .     .    .    "]
[]
[]
[]
[]
[]
[]
[null,"[1] Conformément au règlement intérieur (article 13), seule la participation aux activités sociales et sportives pourront engendrer "]
[null,"une contribution financière. "]
[]
["Règlement intérieur de YES Vélizy le Bois "]
[]
["DISPOSITIONS PRELIMINAIRES"]
[]
["1. Objet du règlement intérieur"]
["Le présent règlement définit les modes de fonctionnement des instances de YES Vélizy le Bois, les modalités de gestion des adhésions, les activités. Ce règlement complète les Statuts."]
[]
["2. Procédure de modification de certaines règles du règlement intérieur de YES Vélizy le Bois"]
["Le règlement intérieur de YES Vélizy le Bois est établi par le Bureau et est soumis à l'approbation de l’Assemblée Générale. Il peut être modifié pour s'adapter aux circonstances. Les modifications sont proposées par le Bureau qui les soumet à l'approbation de la plus proche Assemblée Générale."]
[]
[]
["TITRE I - DROITS ET OBLIGATIONS DES MEMBRES"]
[]
["ARTICLE 1 – DIVERSES CATEGORIES DE MEMBRES"]
[]
["L'association comprend :"]
[]
["·         des membres adhérents ;"]
["·         des membres honoraires ;"]
["·         des correspondants nationaux et internationaux."]
[]
["ARTICLE 2 – MEMBRES ADHÉRENTS"]
[]
["2.1             Droits"]
[]
["Toute personne salariée ou apprentie des sociétés Thales Communications & Security SAS et Thales Services, ayant un contrat de travail à durée déterminée ou indéterminée ou ayant un contrat d’alternance, peut prétendre à la qualité de membre Adhérent (voir article 6)."]
[]
["Les statuts et le règlement intérieur à jour sont remis à chaque nouvel adhérent."]
[]
["Les membres adhérents peuvent :"]
["·         assister à l'Assemblée Générale et au Bureau avec un seul droit de vote par membre adhérent ;"]
["·         participer aux séances des groupes de travail ;"]
["·         recevoir les documents et rapports approuvés par le Bureau et dont celui-ci autorise la diffusion ;"]
["·         être élus au Bureau."]
[]
["2.2             Obligations"]
[]
["Chaque membre adhérent s’engage à respecter le règlement intérieur et à participer  à l’activité de l’Association, selon ses disponibilités."]
[]
["2.3             Exclusions"]
[]
["Conformément à l’article 7 des statuts, un membre peut être exclu pour :"]
["·         infraction aux statuts et règlement intérieur ;"]
["·         comportement non conforme avec l’éthique de l’association ;"]
["·         propos désobligeants ;"]
["·         matériels détériorés ;"]
["·         tout autre motif portant préjudice aux intérêts moraux ou matériels de l’association."]
["ARTICLE 3 – MEMBRES HONORAIRES"]
[]
["Toute personne ayant rendu des services éminents à l'Association peut, à titre individuel, être élue membre honoraire par l'Assemblée Générale."]
[]
["Les membres honoraires peuvent participer à l'Assemblée Générale sans droit de vote."]
[]
["Ils peuvent être invités par le Bureau à participer aux conférences ainsi qu’aux réunions des groupes de travail."]
[]
[]
["ARTICLE 4 – CORRESPONDANTS NATIONAUX & INTERNATIONAUX"]
[]
["Toute personne salariée du groupe THALES (hors sociétés pré-citées), membre d’une organisation du groupe THALES similaire à YES Vélizy le Bois, peut être considérée comme correspondant."]
[]
["Un correspondant peut :"]
["·         assister à l'Assemblée Générale et y participer, sans droit de vote ;"]
["·         participer aux activités de l’Association ;"]
["·         recevoir les documents et comptes-rendus correspondants approuvés par le Bureau."]
[]
["Les correspondants membres d’une organisation ou association similaire à YES Vélizy le Bois ne seront pas financés par YES Vélizy le Bois."]
[]
["Les correspondants sont invités à partager leur expérience avec les membres, proposer et aider à l’organisation des visites de leurs sites."]
[]
[]
["TITRE 2 - L'ASSEMBLEE GENERALE"]
[]
["ARTICLE 5 – MODALITES DES REUNIONS"]
[]
["La composition, la fréquence et les fonctions de l’Assemblée Générale sont définies dans les Statuts à l’Article 9. "]
[]
["Le Président fixe le lieu et l'ordre du jour des Assemblées Générales."]
[]
["Les convocations sont adressées aux membres par le Secrétaire au moins dix (10) jours calendaires avant la date fixée et l’ordre du jour est inscrit sur les convocations."]
[]
[]
["ARTICLE 6 – PROCEDURE DE VOTE"]
[]
["Seuls les membres adhérents ont droit de vote, à raison d'une voix par membre."]
[]
["Le vote, à l’exception des élections des membres du Bureau, peut avoir lieu à main levée ou à bulletin secret, à la diligence du Président."]
[]
["Un membre non représenté en séance peut déléguer son droit de vote par écrit au représentant d'un autre membre. La délégation écrite doit parvenir au Bureau au plus tard à l'ouverture de la séance ; elle doit porter l'indication du membre mandant et la désignation nominative de son mandataire."]
[]
["Les décisions de l’Assemblée générale sont prises à la majorité simple (50% + 1) des suffrages exprimés."]
[]
[]
["ARTICLE 7 – RAPPORT ANNUEL "]
[]
["Un rapport annuel reproduisant les rapports présentés, les décisions prises et éventuellement les principales interventions à l'Assemblée Générale, est adressé, après approbation par les membres du Bureau, à chacun des membres de l'Association, dans un délai de trois (3) mois après l'Assemblée Générale."]
[]
[]
[]
["TITRE 3 - LE BUREAU"]
[]
["ARTICLE 8 – FONCTIONNEMENT DU BUREAU"]
[]
["En cas d'indisponibilité temporaire ou permanente du Président, celui-ci est remplacé par son Vice-Président."]
[]
["La composition, la fréquence et les fonctions du Bureau sont définis dans les Statuts à l’Article 10. "]
[]
[]
["ARTICLE 9 – CONVOCATION ET PROCEDURES DE VOTE"]
[]
["Les dates des réunions sont fixées par le Bureau lui-même d'une séance à l'autre. L'ordre du jour d'une réunion est déterminé par le Bureau. Tout membre du Bureau peut proposer au Président l'inclusion de sujets supplémentaires."]
[]
["Sans préjudice de ce qui précède, le Président convoque par courrier les membres du Bureau aux réunions en précisant l’ordre du jour. "]
[]
["Les délibérations sont prises à la majorité simple (50% + 1) des voix des membres présents ou représentés. En cas d’égalité, la voix du Président est prépondérante."]
[]
["Toutes les délibérations du Bureau sont consignées dans un Compte-Rendu envoyé par courrier."]
[]
["Le Bureau peut décider d'inviter à ses séances à titre consultatif toute personne dont il souhaite recueillir les avis."]
[]
[]
["ARTICLE 10 – COMPOSITION ET MISSIONS"]
[]
["La composition, l’organisation et les missions du Bureau sont définies dans les Statuts aux Articles 10 à 13."]

{"sheet":"outil","index":1,"n_rows":43,"n_cols":7,"rows_kept":43,"cut":false,"hidden":true,"merged":[]}
["listes de choix our champs contraints du formulaire",null,null,null,null,"le nom du fichier \"liste des adhérents : ","2019_Liste_Membres_YES_VLB.xlsm"]
["Apprenti(e) ","SGF",{"$f":"LOWER(formulaire!$G$17)&\".\"&LOWER(formulaire!$E$17)& $D2","v":".@thalesgroup.com"},"@thalesgroup.com","Vélizy le Bois","X","je valide ma demande d'adhésion à YES Vélizy le bois, aux conditions indiquées ci-dessus"]
["CDI","TS",{"$f":"LOWER(formulaire!$G$17)&\".\"&LOWER(formulaire!$E$17)& $D3","v":".@mythalesgroup.com"},"@mythalesgroup.com","Toulouse"]
["CDD",null,{"$f":"LOWER(formulaire!$G$17)&\".\"&LOWER(formulaire!$E$17)& $D4","v":".@fr.thalesgroup.com"},"@fr.thalesgroup.com"]
[null,null,{"$f":"LOWER(formulaire!$G$17)&\".\"&LOWER(formulaire!$E$17)& $D5","v":".@mythalesgroup.io"},"@mythalesgroup.io"]
[]
[]
[]
[]
[]
["Macro : Cahier des charges"]
["Automatiser l'ajout d'un nouvel adhérent YES dans la liste des adhérents"]
["L'outil récupère toutes les informations dans le formulaire d'adhésion, et les ajoute en bas de la liste"]
[]
["Macro : Conception "]
["La macro est incluse dans le fichier formulaire (le présent fichier)"]
["Elle s'active par un bouton situé dans le formulaire"]
["Elle ne fonctionne que si le fichier \"liste des adhérents\" est ouvert"]
["Prévoir  un texte \"réservé bureau YES\" sur le bouton d'activation, et un message d'erreur clair si le fichier \"liste des adhérents\" n'est pas ouvert."]
[]
["pour mémoire, autre solution non retenue : "]
[null,"La macro est incluse dans le fichier \"liste des adhérents\""]
[null,"mais dans ce cas on ne peut pas facilement gérer le message d'erreur si le fichier \"liste des adhérents \" n'est pas ouvert "]
["Trois parties : "]
["1 - \"initialiation\""]
["mettre en variable : "]
[null,"le nom du fichier \"liste des adhérents\""]
[null,"le nom du fichier formulaire (fichier courant au lancement macro"]
[null,"le n° de 1e ligne vide, dans la liste des adhérents"]
[]
["2 - \"copie\" "]
[null,"lire le formulaire, mettre en variable chaque champ saisi"]
[null,"accéder à la liste des adhérents, et remplir la nouvelle ligne, avec toutes ces informations"]
[]
["3 - \"cloture\""]
[null,"fermer le fichier formulaire"]
[null,"enregistrer le fichier liste adhérent complété",null,"<- attention, voir interférence avec TOL YES VLB"]
[]
[]
["2017-05-12","reste à faire"]
[null,"ajouter une macro de génération automatique de mail de confirmation d'adhésion"]
[null,"voir comment on gère la signature de l'adhérent"]
[null,"voir si on change le format des n° de téléphone"]